Reaction Details
Target5-hydroxytryptamine receptor 5A
LigandBDBM50401359
Substrate/Competitorn/a
Meas. Tech.ChEMBL_884327 (CHEMBL2210360)
Ki>10000±n/a nM
Citation Banister, SDManoli, MDoddareddy, MRHibbs, DEKassiou, M As(1) receptor pharmacophore derived from a series of N-substituted 4-azahexacyclo[5.4.1.0(2,6).0(3,10).0(5,9).0(8,11)]dodecan-3-ols (AHDs). Bioorg Med Chem Lett22:6053-8 (2012) 
 
5-hydroxytryptamine receptor 5A
Name:5-hydroxytryptamine receptor 5A
Type:Enzyme
Mol. Mass.:40266.25
Organism:Homo sapiens (Human)
Description:P47898
Residue:357
BDBM50401359
NameBDBM50401359
Synonyms:CHEMBL2205816
TypeSmall organic molecule
Emp. Form.C18H20N2O
Mol. Mass.280.3642
SMILESOC12C3C4C5C3C(C3C5CC4C13)N2CCc1ccccn1