Reaction Details
TargetKappa-type opioid receptor
LigandBDBM50288954
Substrate/Competitorn/a
Meas. Tech.ChEMBL_884082 (CHEMBL2215558)
Ki 488±n/a nM
Citation Banister, SDManoli, MDoddareddy, MRHibbs, DEKassiou, M As(1) receptor pharmacophore derived from a series of N-substituted 4-azahexacyclo[5.4.1.0(2,6).0(3,10).0(5,9).0(8,11)]dodecan-3-ols (AHDs). Bioorg Med Chem Lett22:6053-8 (2012) 
 
Kappa-type opioid receptor
Name:Kappa-type opioid receptor
Type:G Protein-Coupled Receptor (GPCR)
Mol. Mass.:42648.76
Organism:Homo sapiens (Human)
Description:P41145
Residue:380
BDBM50288954
NameBDBM50288954
Synonyms:11-benzyl-11-azahexacyclo[5.4.1.02,6.03,10.04,8.09,12]dodecan-1-ol; hydrochloride CHEMBL538300
TypeSmall organic molecule
Emp. Form.C18H19NO
Mol. Mass.265.3496
SMILESOC12C3C4C5C3C(C3C5CC4C13)N2Cc1ccccc1