Reaction Details
TargetMuscarinic acetylcholine receptor M1
LigandBDBM50401363
Substrate/Competitorn/a
Meas. Tech.ChEMBL_884089 (CHEMBL2215565)
Ki 4610±n/a nM
Citation Banister, SDManoli, MDoddareddy, MRHibbs, DEKassiou, M As(1) receptor pharmacophore derived from a series of N-substituted 4-azahexacyclo[5.4.1.0(2,6).0(3,10).0(5,9).0(8,11)]dodecan-3-ols (AHDs). Bioorg Med Chem Lett22:6053-8 (2012) 
 
Muscarinic acetylcholine receptor M1
Name:Muscarinic acetylcholine receptor M1
Type:Protein
Mol. Mass.:51442.54
Organism:Homo sapiens (Human)
Description:P11229
Residue:460
BDBM50401363
NameBDBM50401363
Synonyms:CHEMBL2205827
TypeSmall organic molecule
Emp. Form.C20H23NO3
Mol. Mass.325.4015
SMILESCOc1ccc(CN2C3C4C5C6C4C2(O)C2C6CC5C32)cc1OC