Reaction Details
TargetMuscarinic acetylcholine receptor M2
LigandBDBM50401364
Substrate/Competitorn/a
Meas. Tech.ChEMBL_884092 (CHEMBL2215568)
Ki>10000±n/a nM
Citation Banister, SDManoli, MDoddareddy, MRHibbs, DEKassiou, M As(1) receptor pharmacophore derived from a series of N-substituted 4-azahexacyclo[5.4.1.0(2,6).0(3,10).0(5,9).0(8,11)]dodecan-3-ols (AHDs). Bioorg Med Chem Lett22:6053-8 (2012) 
 
Muscarinic acetylcholine receptor M2
Name:Muscarinic acetylcholine receptor M2
Type:GPCR
Mol. Mass.:51730.61
Organism:Homo sapiens (Human)
Description:P08172
Residue:466
BDBM50401364
NameBDBM50401364
Synonyms:CHEMBL2205833
TypeSmall organic molecule
Emp. Form.C17H18N2O
Mol. Mass.266.3376
SMILESOC12C3C4C5C3C(C3C5CC4C13)N2Cc1cccnc1