Reaction Details
TargetMuscarinic acetylcholine receptor M2
LigandBDBM50401367
Substrate/Competitorn/a
Meas. Tech.ChEMBL_884092 (CHEMBL2215568)
Ki 1295±n/a nM
Citation Banister, SDManoli, MDoddareddy, MRHibbs, DEKassiou, M As(1) receptor pharmacophore derived from a series of N-substituted 4-azahexacyclo[5.4.1.0(2,6).0(3,10).0(5,9).0(8,11)]dodecan-3-ols (AHDs). Bioorg Med Chem Lett22:6053-8 (2012) 
 
Muscarinic acetylcholine receptor M2
Name:Muscarinic acetylcholine receptor M2
Type:GPCR
Mol. Mass.:51730.61
Organism:Homo sapiens (Human)
Description:P08172
Residue:466
BDBM50401367
NameBDBM50401367
Synonyms:CHEMBL2205829
TypeSmall organic molecule
Emp. Form.C19H19NO3
Mol. Mass.309.3591
SMILESOC12C3C4C5C3C(C3C5CC4C13)N2Cc1ccc2OCOc2c1