Reaction Details
TargetSigma non-opioid intracellular receptor 1
LigandBDBM50338990
Substrate/Competitorn/a
Meas. Tech.ChEMBL_884050 (CHEMBL2215099)
Ki 4.6±n/a nM
Citation Banister, SDManoli, MDoddareddy, MRHibbs, DEKassiou, M As(1) receptor pharmacophore derived from a series of N-substituted 4-azahexacyclo[5.4.1.0(2,6).0(3,10).0(5,9).0(8,11)]dodecan-3-ols (AHDs). Bioorg Med Chem Lett22:6053-8 (2012) 
 
Sigma non-opioid intracellular receptor 1
Name:Sigma non-opioid intracellular receptor 1
Type:Enzyme Catalytic Domain
Mol. Mass.:25266.54
Organism:RAT
Description:Q9R0C9
Residue:223
BDBM50338990
NameBDBM50338990
Synonyms:1-(3,4-dimethoxyphenethyl)-4-(3-phenylpropyl)piperazine CHEMBL408867 | N-phenylpropyl-N''-3,4-dimethoxyphenethyl piperazine
TypeSmall organic molecule
Emp. Form.C23H32N2O2
Mol. Mass.368.5124
SMILESCOc1ccc(CCN2CCN(CCCc3ccccc3)CC2)cc1OC