Reaction Details
Target5-hydroxytryptamine receptor 1B
LigandBDBM50401375
Substrate/Competitorn/a
Meas. Tech.ChEMBL_884073 (CHEMBL2215549)
Ki>10000±n/a nM
Citation Banister, SDManoli, MDoddareddy, MRHibbs, DEKassiou, M As(1) receptor pharmacophore derived from a series of N-substituted 4-azahexacyclo[5.4.1.0(2,6).0(3,10).0(5,9).0(8,11)]dodecan-3-ols (AHDs). Bioorg Med Chem Lett22:6053-8 (2012) 
 
5-hydroxytryptamine receptor 1B
Name:5-hydroxytryptamine receptor 1B
Type:G Protein-Coupled Receptor (GPCR)
Mol. Mass.:43579.17
Organism:Homo sapiens (Human)
Description:Receptor binding assays were performed using human clone stably expressed in CHO cells
Residue:390
BDBM50401375
NameBDBM50401375
Synonyms:CHEMBL2205814
TypeSmall organic molecule
Emp. Form.C21H25NO3
Mol. Mass.339.4281
SMILESCOc1ccc(CCN2C3C4C5C6C4C2(O)C2C6CC5C32)cc1OC