Reaction Details
TargetAlpha-2C adrenergic receptor
LigandBDBM50401368
Substrate/Competitorn/a
Meas. Tech.ChEMBL_884059 (CHEMBL2215108)
Ki 4347±n/a nM
Citation Banister, SDManoli, MDoddareddy, MRHibbs, DEKassiou, M As(1) receptor pharmacophore derived from a series of N-substituted 4-azahexacyclo[5.4.1.0(2,6).0(3,10).0(5,9).0(8,11)]dodecan-3-ols (AHDs). Bioorg Med Chem Lett22:6053-8 (2012) 
 
Alpha-2C adrenergic receptor
Name:Alpha-2C adrenergic receptor
Type:Enzyme
Mol. Mass.:49552.32
Organism:Homo sapiens (Human)
Description:P18825
Residue:462
BDBM50401368
NameBDBM50401368
Synonyms:CHEMBL2205813
TypeSmall organic molecule
Emp. Form.C21H25NO3
Mol. Mass.339.4281
SMILESCOc1cccc(CCN2C3C4C5C6C4C2(O)C2C6CC5C32)c1OC