Reaction Details
Target5-hydroxytryptamine receptor 7
LigandBDBM50401376
Substrate/Competitorn/a
Meas. Tech.ChEMBL_884088 (CHEMBL2215564)
Ki 6259±n/a nM
Citation Banister, SDManoli, MDoddareddy, MRHibbs, DEKassiou, M As(1) receptor pharmacophore derived from a series of N-substituted 4-azahexacyclo[5.4.1.0(2,6).0(3,10).0(5,9).0(8,11)]dodecan-3-ols (AHDs). Bioorg Med Chem Lett22:6053-8 (2012) 
 
5-hydroxytryptamine receptor 7
Name:5-hydroxytryptamine receptor 7
Type:G Protein-Coupled Receptor (GPCR)
Mol. Mass.:53573.08
Organism:Homo sapiens (Human)
Description:P34969
Residue:479
BDBM50401376
NameBDBM50401376
Synonyms:CHEMBL2205812
TypeSmall organic molecule
Emp. Form.C20H23NO2
Mol. Mass.309.4021
SMILESCOc1ccc(CCN2C3C4C5C6C4C2(O)C2C6CC5C32)cc1