Reaction Details
TargetD(1A) dopamine receptor
LigandBDBM50401362
Substrate/Competitorn/a
Meas. Tech.ChEMBL_884318 (CHEMBL2210351)
Ki 2979±n/a nM
Citation Banister, SDManoli, MDoddareddy, MRHibbs, DEKassiou, M As(1) receptor pharmacophore derived from a series of N-substituted 4-azahexacyclo[5.4.1.0(2,6).0(3,10).0(5,9).0(8,11)]dodecan-3-ols (AHDs). Bioorg Med Chem Lett22:6053-8 (2012) 
 
D(1A) dopamine receptor
Name:D(1A) dopamine receptor
Type:Enzyme
Mol. Mass.:49303.43
Organism:Homo sapiens (Human)
Description:P21728
Residue:446
BDBM50401362
NameBDBM50401362
Synonyms:CHEMBL2205836
TypeSmall organic molecule
Emp. Form.C20H23NO2
Mol. Mass.309.4021
SMILESCOc1ccccc1CCN1C2C3C4C5C3C1(O)C1C5CC4C21