Reaction Details
TargetNeuraminidase
LigandBDBM4994
Substrate/Competitorn/a
Meas. Tech.ChEMBL_882379 (CHEMBL2209784)
IC50 2.9±n/a nM
Citation Cheng, TJWeinheimer, STarbet, EBJan, JTCheng, YSShie, JJChen, CLChen, CAHsieh, WCHuang, PWLin, WHWang, SYFang, JMHu, OYWong, CH Development of oseltamivir phosphonate congeners as anti-influenza agents. J Med Chem55:8657-70 (2012) 
 
Neuraminidase
Name:Neuraminidase
Type:PROTEIN
Mol. Mass.:52146.22
Organism:Influenza A virus (strain A/Udorn/307/1972 H3N2)
Description:ChEMBL_882379
Residue:469
BDBM4994
NameBDBM4994
Synonyms:(3R,4R,5S)-5-amino-4-acetamido-3-(pentan-3-yloxy)cyclohex-1-ene-1-carboxylic acid GS4071 | Oseltamivir carboxylate
TypeSmall organic molecule
Emp. Form.C14H24N2O4
Mol. Mass.284.3514
SMILESCCC(CC)O[C@@H]1C=C(C[C@H](N)[C@H]1NC(C)=O)C(O)=O