Reaction Details
TargetAurora kinase A
LigandBDBM50401418
Substrate/Competitorn/a
Meas. Tech.ChEMBL_883357 (CHEMBL2214093)
IC50 600±n/a nM
Citation Bavetsias, VCrumpler, SSun, CAvery, SAtrash, BFaisal, AMoore, ASKosmopoulou, MBrown, NSheldrake, PWBush, KHenley, ABox, GValenti, Mde Haven Brandon, ARaynaud, FIWorkman, PEccles, SABayliss, RLinardopoulos, SBlagg, J Optimization of imidazo[4,5-b]pyridine-based kinase inhibitors: identification of a dual FLT3/Aurora kinase inhibitor as an orally bioavailable preclinical development candidate for the treatment of acute myeloid leukemia. J Med Chem55:8721-34 (2012) 
 
Aurora kinase A
Name:Aurora kinase A
Type:Serine/threonine-protein kinase
Mol. Mass.:45830.98
Organism:Homo sapiens (Human)
Description:O14965
Residue:403
BDBM50401418
NameBDBM50401418
Synonyms:CHEMBL2207511
TypeSmall organic molecule
Emp. Form.C17H17BrN8OS
Mol. Mass.461.339
SMILESCc1cc(CN2CCN(CC2)c2c(Br)cnc3nc([nH]c23)-c2csnn2)no1