Reaction Details
TargetAurora kinase A
LigandBDBM50401444
Substrate/Competitorn/a
Meas. Tech.ChEMBL_883357 (CHEMBL2214093)
IC50 9±n/a nM
Citation Bavetsias, VCrumpler, SSun, CAvery, SAtrash, BFaisal, AMoore, ASKosmopoulou, MBrown, NSheldrake, PWBush, KHenley, ABox, GValenti, Mde Haven Brandon, ARaynaud, FIWorkman, PEccles, SABayliss, RLinardopoulos, SBlagg, J Optimization of imidazo[4,5-b]pyridine-based kinase inhibitors: identification of a dual FLT3/Aurora kinase inhibitor as an orally bioavailable preclinical development candidate for the treatment of acute myeloid leukemia. J Med Chem55:8721-34 (2012) 
 
Aurora kinase A
Name:Aurora kinase A
Type:Serine/threonine-protein kinase
Mol. Mass.:45830.98
Organism:Homo sapiens (Human)
Description:O14965
Residue:403
BDBM50401444
NameBDBM50401444
Synonyms:CHEMBL2203766
TypeSmall organic molecule
Emp. Form.C27H31BrN8O2
Mol. Mass.579.491
SMILESCC(=O)N1CCN(CC1)c1ccc(cc1)-c1nc2ncc(Br)c(N3CCN(Cc4cc(C)on4)CC3)c2[nH]1