Reaction Details
TargetReceptor-type tyrosine-protein kinase FLT3
LigandBDBM50401438
Substrate/Competitorn/a
Meas. Tech.ChEMBL_883356 (CHEMBL2214092)
Kd 5.4±n/a nM
Citation Bavetsias, VCrumpler, SSun, CAvery, SAtrash, BFaisal, AMoore, ASKosmopoulou, MBrown, NSheldrake, PWBush, KHenley, ABox, GValenti, Mde Haven Brandon, ARaynaud, FIWorkman, PEccles, SABayliss, RLinardopoulos, SBlagg, J Optimization of imidazo[4,5-b]pyridine-based kinase inhibitors: identification of a dual FLT3/Aurora kinase inhibitor as an orally bioavailable preclinical development candidate for the treatment of acute myeloid leukemia. J Med Chem55:8721-34 (2012) 
 
Receptor-type tyrosine-protein kinase FLT3
Name:Receptor-type tyrosine-protein kinase FLT3
Type:Enzyme
Mol. Mass.:112888.62
Organism:Homo sapiens (Human)
Description:P36888
Residue:993
BDBM50401438
NameBDBM50401438
Synonyms:CHEMBL2203775
TypeSmall organic molecule
Emp. Form.C26H31ClN8O
Mol. Mass.507.03
SMILESCN1CCN(CC1)c1cccc(c1)-c1nc2ncc(Cl)c(N3CCN(Cc4cc(C)on4)CC3)c2[nH]1