Reaction Details
TargetDNA-dependent protein kinase catalytic subunit
LigandBDBM50401463
Substrate/Competitorn/a
Meas. Tech.ChEMBL_883385 (CHEMBL2214584)
IC50 280±n/a nM
Citation Ihmaid, SKAl-Rawi, JMBradley, CJAngove, MJRobertson, MN Synthesis, DNA-PK inhibition, anti-platelet activity studies of 2-(N-substituted-3-aminopyridine)-substituted-1,3-benzoxazines and DNA-PK and PI3K inhibition, homology modelling studies of 2-morpholino-(7,8-di and 8-substituted)-1,3-benzoxazines. Eur J Med Chem57:85-101 (2012) 
 
DNA-dependent protein kinase catalytic subunit
Name:DNA-dependent protein kinase catalytic subunit
Type:Protein
Mol. Mass.:469114.78
Organism:Homo sapiens (Human)
Description:P78527
Residue:4128
BDBM50401463
NameBDBM50401463
Synonyms:CHEMBL1276684
TypeSmall organic molecule
Emp. Form.C19H19N3O4
Mol. Mass.353.3719
SMILESCc1c(OCc2cccnc2)ccc2c1oc(nc2=O)N1CCOCC1