Reaction Details
TargetBaculoviral IAP repeat-containing protein 2
LigandBDBM50401477
Substrate/Competitorn/a
Meas. Tech.ChEMBL_884122 (CHEMBL2216052)
IC50 1.5±n/a nM
Citation Lecis, DMastrangelo, EBelvisi, LBolognesi, MCivera, MCossu, FDe Cesare, MDelia, DDrago, CManenti, GManzoni, LMilani, MMoroni, EPerego, PPotenza, DRizzo, VScavullo, CScolastico, CServida, FVasile, FSeneci, P Dimeric Smac mimetics/IAP inhibitors as in vivo-active pro-apoptotic agents. Part II: Structural and biological characterization. Bioorg Med Chem20:6709-23 (2012) 
 
Baculoviral IAP repeat-containing protein 2
Name:Baculoviral IAP repeat-containing protein 2
Type:Protein
Mol. Mass.:69900.47
Organism:Homo sapiens (Human)
Description:Q13490
Residue:618
BDBM50401477
NameBDBM50401477
Synonyms:CHEMBL2204567
TypeSmall organic molecule
Emp. Form.C67H95N13O12
Mol. Mass.1274.5511
SMILESCC[C@H](NC)C(=O)N[C@H]1[C@@H](CO)CC[C@H]2CC[C@H](N2C1=O)C(=O)N[C@H](C(=O)NCCOCCOCCOCCn1cc(CCC(=O)NCC[C@H]2CC[C@H]3CC[C@H](N3C(=O)[C@H]2NC(=O)[C@H](CC)NC)C(=O)NC(c2ccccc2)c2ccccc2)nn1)c1ccccc1