Reaction Details
TargetBaculoviral IAP repeat-containing protein 2
LigandBDBM50401479
Substrate/Competitorn/a
Meas. Tech.ChEMBL_884122 (CHEMBL2216052)
IC50 3.2±n/a nM
Citation Lecis, DMastrangelo, EBelvisi, LBolognesi, MCivera, MCossu, FDe Cesare, MDelia, DDrago, CManenti, GManzoni, LMilani, MMoroni, EPerego, PPotenza, DRizzo, VScavullo, CScolastico, CServida, FVasile, FSeneci, P Dimeric Smac mimetics/IAP inhibitors as in vivo-active pro-apoptotic agents. Part II: Structural and biological characterization. Bioorg Med Chem20:6709-23 (2012) 
 
Baculoviral IAP repeat-containing protein 2
Name:Baculoviral IAP repeat-containing protein 2
Type:Protein
Mol. Mass.:69900.47
Organism:Homo sapiens (Human)
Description:Q13490
Residue:618
BDBM50401479
NameBDBM50401479
Synonyms:CHEMBL2204569
TypeSmall organic molecule
Emp. Form.C65H93N11O14
Mol. Mass.1252.4992
SMILESCC[C@H](NC)C(=O)N[C@H]1[C@@H](CO)CC[C@H]2CC[C@H](N2C1=O)C(=O)N[C@H](C(=O)NCCOCCOCCOCCNC(=O)COCC(=O)NC[C@H]1CC[C@H]2CC[C@H](N2C(=O)[C@H]1NC(=O)[C@H](CC)NC)C(=O)NC(c1ccccc1)c1ccccc1)c1ccccc1