Reaction Details
TargetBaculoviral IAP repeat-containing protein 2
LigandBDBM50401480
Substrate/Competitorn/a
Meas. Tech.ChEMBL_884122 (CHEMBL2216052)
IC50 12.6±n/a nM
Citation Lecis, DMastrangelo, EBelvisi, LBolognesi, MCivera, MCossu, FDe Cesare, MDelia, DDrago, CManenti, GManzoni, LMilani, MMoroni, EPerego, PPotenza, DRizzo, VScavullo, CScolastico, CServida, FVasile, FSeneci, P Dimeric Smac mimetics/IAP inhibitors as in vivo-active pro-apoptotic agents. Part II: Structural and biological characterization. Bioorg Med Chem20:6709-23 (2012) 
 
Baculoviral IAP repeat-containing protein 2
Name:Baculoviral IAP repeat-containing protein 2
Type:Protein
Mol. Mass.:69900.47
Organism:Homo sapiens (Human)
Description:Q13490
Residue:618
BDBM50401480
NameBDBM50401480
Synonyms:CHEMBL2204571
TypeSmall organic molecule
Emp. Form.C46H60N14O6S2
Mol. Mass.969.189
SMILESCN[C@@H](C)C(=O)N[C@@H]([C@H](C)OCC#CC#CCO[C@@H](C)[C@H](NC(=O)[C@H](C)NC)C(=O)N1CCC[C@H]1Cn1nnnc1Sc1ccccc1)C(=O)N1CCC[C@H]1Cn1nnnc1Sc1ccccc1