Reaction Details
TargetTyrosine-protein phosphatase non-receptor type 1
LigandBDBM50401506
Substrate/Competitorn/a
Meas. Tech.ChEMBL_882103 (CHEMBL2214491)
Ki 840±n/a nM
Citation He, HBGao, LXDeng, QFMa, WPTang, CLQiu, WWTang, JLi, JYLi, JYang, F Synthesis and biological evaluation of 4,4-dimethyl lithocholic acid derivatives as novel inhibitors of protein tyrosine phosphatase 1B. Bioorg Med Chem Lett22:7237-42 (2012) 
 
Tyrosine-protein phosphatase non-receptor type 1
Name:Tyrosine-protein phosphatase non-receptor type 1
Type:Protein phosphatase
Mol. Mass.:49963.76
Organism:Homo sapiens (Human)
Description:Human recombinant GST-fusion PTP1B (1-435).
Residue:435
BDBM50401506
NameBDBM50401506
Synonyms:CHEMBL2205895
TypeSmall organic molecule
Emp. Form.C33H44N2O2
Mol. Mass.500.7147
SMILESC[C@H](CCC(O)=O)[C@H]1CC[C@H]2[C@@H]3CC=C4C(C)(C)c5c(C[C@]4(C)[C@H]3CC[C@]12C)cnn5-c1ccccc1