Reaction Details
TargetC-C chemokine receptor type 4
LigandBDBM50401556
Substrate/Competitorn/a
Meas. Tech.ChEMBL_882640 (CHEMBL2213077)
Ki 1000±n/a nM
Citation Smethurst, CABevan, NBrooks, CEmmons, AGough, PJMookherjee, CMoores, KPeace, SPhilp, JPiercy, VWatson, SPZippoli, M In vivo activity of an azole series of CCR2 antagonists. Bioorg Med Chem Lett22:7252-5 (2012) 
 
C-C chemokine receptor type 4
Name:C-C chemokine receptor type 4
Type:Enzyme
Mol. Mass.:41406.41
Organism:Homo sapiens (Human)
Description:P51679
Residue:360
BDBM50401556
NameBDBM50401556
Synonyms:CHEMBL2207091
TypeSmall organic molecule
Emp. Form.C16H12ClF3N4O2S
Mol. Mass.416.805
SMILESFC(F)(F)c1cccc(c1)S(=O)(=O)Nc1cc(Cl)ccc1Cn1ccnn1