Reaction Details
TargetC-C chemokine receptor type 2
LigandBDBM50401558
Substrate/Competitorn/a
Meas. Tech.ChEMBL_882642 (CHEMBL2213079)
Ki 31.62±n/a nM
Citation Smethurst, CABevan, NBrooks, CEmmons, AGough, PJMookherjee, CMoores, KPeace, SPhilp, JPiercy, VWatson, SPZippoli, M In vivo activity of an azole series of CCR2 antagonists. Bioorg Med Chem Lett22:7252-5 (2012) 
 
C-C chemokine receptor type 2
Name:C-C chemokine receptor type 2
Type:Enzyme
Mol. Mass.:41932.32
Organism:Homo sapiens (Human)
Description:P41597
Residue:374
BDBM50401558
NameBDBM50401558
Synonyms:CHEMBL2207097
TypeSmall organic molecule
Emp. Form.C15H11Cl2FN4O2S
Mol. Mass.401.243
SMILESFc1ccc(Cn2ccnn2)c(NS(=O)(=O)c2ccc(Cl)c(Cl)c2)c1