Reaction Details
TargetC-C chemokine receptor type 2
LigandBDBM50401564
Substrate/Competitorn/a
Meas. Tech.ChEMBL_882642 (CHEMBL2213079)
Ki 63.1±n/a nM
Citation Smethurst, CABevan, NBrooks, CEmmons, AGough, PJMookherjee, CMoores, KPeace, SPhilp, JPiercy, VWatson, SPZippoli, M In vivo activity of an azole series of CCR2 antagonists. Bioorg Med Chem Lett22:7252-5 (2012) 
 
C-C chemokine receptor type 2
Name:C-C chemokine receptor type 2
Type:Enzyme
Mol. Mass.:41932.32
Organism:Homo sapiens (Human)
Description:P41597
Residue:374
BDBM50401564
NameBDBM50401564
Synonyms:CHEMBL2207095
TypeSmall organic molecule
Emp. Form.C17H13ClN4O2S2
Mol. Mass.404.894
SMILESClc1ccc(Cn2ccnn2)c(NS(=O)(=O)c2csc3ccccc23)c1