Reaction Details
TargetC-C chemokine receptor type 2
LigandBDBM50401552
Substrate/Competitorn/a
Meas. Tech.ChEMBL_882639 (CHEMBL2213076)
Ki 100±n/a nM
Citation Smethurst, CABevan, NBrooks, CEmmons, AGough, PJMookherjee, CMoores, KPeace, SPhilp, JPiercy, VWatson, SPZippoli, M In vivo activity of an azole series of CCR2 antagonists. Bioorg Med Chem Lett22:7252-5 (2012) 
 
C-C chemokine receptor type 2
Name:C-C chemokine receptor type 2
Type:Enzyme
Mol. Mass.:41932.32
Organism:Homo sapiens (Human)
Description:P41597
Residue:374
BDBM50401552
NameBDBM50401552
Synonyms:CHEMBL2207080
TypeSmall organic molecule
Emp. Form.C17H14Cl3N5O2S
Mol. Mass.458.749
SMILESClc1ccc(Cn2nnnc2C2CC2)c(NS(=O)(=O)c2ccc(Cl)c(Cl)c2)c1