Reaction Details
TargetCyclin-dependent kinase 1
LigandBDBM50359807
Substrate/Competitorn/a
Meas. Tech.ChEMBL_887293 (CHEMBL2216272)
IC50 7500±n/a nM
Citation Lainchbury, MMatthews, TPMcHardy, TBoxall, KJWalton, MIEve, PDHayes, AValenti, MRde Haven Brandon, AKBox, GAherne, GWReader, JCRaynaud, FIEccles, SAGarrett, MDCollins, I Discovery of 3-alkoxyamino-5-(pyridin-2-ylamino)pyrazine-2-carbonitriles as selective, orally bioavailable CHK1 inhibitors. J Med Chem55:10229-40 (2012) 
 
Cyclin-dependent kinase 1
Name:Cyclin-dependent kinase 1
Type:Enzyme Subunit
Mol. Mass.:34101.08
Organism:Homo sapiens (Human)
Description:P06493
Residue:297
BDBM50359807
NameBDBM50359807
Synonyms:CHEMBL1928705
TypeSmall organic molecule
Emp. Form.C19H19ClN6O
Mol. Mass.382.847
SMILESC[C@H](CN(C)C)Oc1nc(Nc2cc3cccc(Cl)c3cn2)cnc1C#N