Reaction Details
TargetCyclin-dependent kinase 1
LigandBDBM50401617
Substrate/Competitorn/a
Meas. Tech.ChEMBL_887293 (CHEMBL2216272)
IC50 10000±n/a nM
Citation Lainchbury, MMatthews, TPMcHardy, TBoxall, KJWalton, MIEve, PDHayes, AValenti, MRde Haven Brandon, AKBox, GAherne, GWReader, JCRaynaud, FIEccles, SAGarrett, MDCollins, I Discovery of 3-alkoxyamino-5-(pyridin-2-ylamino)pyrazine-2-carbonitriles as selective, orally bioavailable CHK1 inhibitors. J Med Chem55:10229-40 (2012) 
 
Cyclin-dependent kinase 1
Name:Cyclin-dependent kinase 1
Type:Enzyme Subunit
Mol. Mass.:34101.08
Organism:Homo sapiens (Human)
Description:P06493
Residue:297
BDBM50401617
NameBDBM50401617
Synonyms:CHEMBL2204592 | US9403797, PAPC-A-02
TypeSmall organic molecule
Emp. Form.C20H25N9O
Mol. Mass.407.4722
SMILESCNc1cc(Nc2cnc(C#N)c(O[C@H](C)CN(C)C)n2)ncc1-c1cnn(C)c1