Reaction Details
TargetSerine/threonine-protein kinase Chk1
LigandBDBM50401624
Substrate/Competitorn/a
Meas. Tech.ChEMBL_887300 (CHEMBL2216279)
IC50 40±n/a nM
Citation Lainchbury, MMatthews, TPMcHardy, TBoxall, KJWalton, MIEve, PDHayes, AValenti, MRde Haven Brandon, AKBox, GAherne, GWReader, JCRaynaud, FIEccles, SAGarrett, MDCollins, I Discovery of 3-alkoxyamino-5-(pyridin-2-ylamino)pyrazine-2-carbonitriles as selective, orally bioavailable CHK1 inhibitors. J Med Chem55:10229-40 (2012) 
 
Serine/threonine-protein kinase Chk1
Name:Serine/threonine-protein kinase Chk1
Type:Enzyme Catalytic Domain
Mol. Mass.:54443.02
Organism:Homo sapiens (Human)
Description:gi_166295192
Residue:476
BDBM50401624
NameBDBM50401624
Synonyms:CHEMBL2203847
TypeSmall organic molecule
Emp. Form.C18H23N7O3
Mol. Mass.385.4203
SMILESCNc1cc(Nc2cnc(C#N)c(O[C@H](C)CN(C)C)n2)ncc1C(=O)OC