Reaction Details
TargetPotassium voltage-gated channel subfamily H member 2
LigandBDBM50401617
Substrate/Competitorn/a
Meas. Tech.ChEMBL_887296 (CHEMBL2216275)
IC50 12000±n/a nM
Citation Lainchbury, MMatthews, TPMcHardy, TBoxall, KJWalton, MIEve, PDHayes, AValenti, MRde Haven Brandon, AKBox, GAherne, GWReader, JCRaynaud, FIEccles, SAGarrett, MDCollins, I Discovery of 3-alkoxyamino-5-(pyridin-2-ylamino)pyrazine-2-carbonitriles as selective, orally bioavailable CHK1 inhibitors. J Med Chem55:10229-40 (2012) 
 
Potassium voltage-gated channel subfamily H member 2
Name:Potassium voltage-gated channel subfamily H member 2
Type:Multi-pass membrane protein
Mol. Mass.:126672.65
Organism:Homo sapiens (Human)
Description:Q12809
Residue:1159
BDBM50401617
NameBDBM50401617
Synonyms:CHEMBL2204592 | US9403797, PAPC-A-02
TypeSmall organic molecule
Emp. Form.C20H25N9O
Mol. Mass.407.4722
SMILESCNc1cc(Nc2cnc(C#N)c(O[C@H](C)CN(C)C)n2)ncc1-c1cnn(C)c1