Reaction Details
TargetPeptidyl-glycine alpha-amidating monooxygenase
LigandBDBM50401756
Substrate/Competitorn/a
Meas. Tech.ChEMBL_885020 (CHEMBL2211744)
IC50 71000±n/a nM
Citation Morris, KMCao, FOnagi, HAltamore, TMGamble, ABEaston, CJ Prohormone-substrate peptide sequence recognition by peptidylglycinea-amidating monooxygenase and its reflection in increased glycolate inhibitor potency. Bioorg Med Chem Lett22:7015-8 (2012) 
 
Peptidyl-glycine alpha-amidating monooxygenase
Name:Peptidyl-glycine alpha-amidating monooxygenase
Type:PROTEIN
Mol. Mass.:108328.29
Organism:Homo sapiens (Human)
Description:ChEMBL_885021
Residue:973
BDBM50401756
NameBDBM50401756
Synonyms:CHEMBL2207143
TypeSmall organic molecule
Emp. Form.C45H67N11O15S2
Mol. Mass.1066.208
SMILESCC[C@H](C)[C@@H]1NC(=O)[C@H](Cc2ccc(O)cc2)NC(=O)[C@@H](N)CSSC[C@H](NC(=O)[C@H](CC(N)=O)NC(=O)[C@H](CCC(N)=O)NC1=O)C(=O)N1CCC[C@H]1C(=O)N[C@@H](CC(C)C)C(=O)NCC(=O)OCC(O)=O