Reaction Details
TargetPeptidyl-glycine alpha-amidating monooxygenase
LigandBDBM50401757
Substrate/Competitorn/a
Meas. Tech.ChEMBL_885020 (CHEMBL2211744)
IC50 180000±n/a nM
Citation Morris, KMCao, FOnagi, HAltamore, TMGamble, ABEaston, CJ Prohormone-substrate peptide sequence recognition by peptidylglycinea-amidating monooxygenase and its reflection in increased glycolate inhibitor potency. Bioorg Med Chem Lett22:7015-8 (2012) 
 
Peptidyl-glycine alpha-amidating monooxygenase
Name:Peptidyl-glycine alpha-amidating monooxygenase
Type:PROTEIN
Mol. Mass.:108328.29
Organism:Homo sapiens (Human)
Description:ChEMBL_885021
Residue:973
BDBM50401757
NameBDBM50401757
Synonyms:CHEMBL2207142
TypeSmall organic molecule
Emp. Form.C17H26N2O8
Mol. Mass.386.3969
SMILESCC(C)C[C@H](OC(=O)[C@@H]1CCCN1C(C)=O)C(=O)NCC(=O)OCC(O)=O