Reaction Details
TargetPeptidyl-glycine alpha-amidating monooxygenase
LigandBDBM82195
Substrate/Competitorn/a
Meas. Tech.ChEMBL_885020 (CHEMBL2211744)
IC50 1100000±n/a nM
Citation Morris, KMCao, FOnagi, HAltamore, TMGamble, ABEaston, CJ Prohormone-substrate peptide sequence recognition by peptidylglycinea-amidating monooxygenase and its reflection in increased glycolate inhibitor potency. Bioorg Med Chem Lett22:7015-8 (2012) 
 
Peptidyl-glycine alpha-amidating monooxygenase
Name:Peptidyl-glycine alpha-amidating monooxygenase
Type:PROTEIN
Mol. Mass.:108328.29
Organism:Homo sapiens (Human)
Description:ChEMBL_885021
Residue:973
BDBM82195
NameBDBM82195
Synonyms:Substrate analogue, 13
TypeSmall organic molecule
Emp. Form.C4H6O4
Mol. Mass.118.088
SMILESCC(=O)OCC(O)=O