Reaction Details
TargetPeptidyl-glycine alpha-amidating monooxygenase
LigandBDBM50401753
Substrate/Competitorn/a
Meas. Tech.ChEMBL_885021 (CHEMBL2211745)
IC50 980000±n/a nM
Citation Morris, KMCao, FOnagi, HAltamore, TMGamble, ABEaston, CJ Prohormone-substrate peptide sequence recognition by peptidylglycinea-amidating monooxygenase and its reflection in increased glycolate inhibitor potency. Bioorg Med Chem Lett22:7015-8 (2012) 
 
Peptidyl-glycine alpha-amidating monooxygenase
Name:Peptidyl-glycine alpha-amidating monooxygenase
Type:PROTEIN
Mol. Mass.:108328.29
Organism:Homo sapiens (Human)
Description:ChEMBL_885021
Residue:973
BDBM50401753
NameBDBM50401753
Synonyms:CHEMBL2207146
TypeSmall organic molecule
Emp. Form.C12H19N3O6
Mol. Mass.301.2958
SMILESC[C@H](NC(=O)CN)C(=O)N1CCC[C@H]1C(=O)OCC(O)=O