Reaction Details
TargetPeptidyl-glycine alpha-amidating monooxygenase
LigandBDBM50401755
Substrate/Competitorn/a
Meas. Tech.ChEMBL_885021 (CHEMBL2211745)
IC50 600000±n/a nM
Citation Morris, KMCao, FOnagi, HAltamore, TMGamble, ABEaston, CJ Prohormone-substrate peptide sequence recognition by peptidylglycinea-amidating monooxygenase and its reflection in increased glycolate inhibitor potency. Bioorg Med Chem Lett22:7015-8 (2012) 
 
Peptidyl-glycine alpha-amidating monooxygenase
Name:Peptidyl-glycine alpha-amidating monooxygenase
Type:PROTEIN
Mol. Mass.:108328.29
Organism:Homo sapiens (Human)
Description:ChEMBL_885021
Residue:973
BDBM50401755
NameBDBM50401755
Synonyms:CHEMBL2207144
TypeSmall organic molecule
Emp. Form.C7H11NO4
Mol. Mass.173.1665
SMILESOC(=O)COC(=O)[C@@H]1CCCN1