Reaction Details
TargetCathepsin S
LigandBDBM50401834
Substrate/Competitorn/a
Meas. Tech.ChEMBL_885155 (CHEMBL2213246)
IC50 0.6±n/a nM
Citation Moss, NXiong, ZBurke, MCogan, DGao, DAHaverty, KHeim-Riether, AHickey, ERNagaraja, RNetherton, MO'Shea, KRamsden, PSchwartz, RShih, DTWard, YYoung, EZhang, Q Exploration of cathepsin S inhibitors characterized by a triazole P1-P2 amide replacement. Bioorg Med Chem Lett22:7189-93 (2012) 
 
Cathepsin S
Name:Cathepsin S
Type:Protein
Mol. Mass.:37507.38
Organism:Homo sapiens (Human)
Description:P25774
Residue:331
BDBM50401834
NameBDBM50401834
Synonyms:CHEMBL2207571
TypeSmall organic molecule
Emp. Form.C17H21N5OS
Mol. Mass.343.447
SMILESC[C@H](C#N)n1cc(nn1)[C@@H](NC(=O)c1ccsc1)C1CCCCC1