Reaction Details
TargetSigma non-opioid intracellular receptor 1
LigandBDBM50401859
Substrate/Competitorn/a
Meas. Tech.ChEMBL_886105 (CHEMBL2210027)
IC50 36.1±n/a nM
Citation Riganas, SPapanastasiou, IFoscolos, GBTsotinis, ASerin, GMirjolet, JFDimas, KKourafalos, VNEleutheriades, AMoutsos, VIKhan, HGeorgakopoulou, SZaniou, APrassa, MTheodoropoulou, MMantelas, APondiki, SVamvakides, A New adamantane phenylalkylamines withs-receptor binding affinity and anticancer activity, associated with putative antagonism of neuropathic pain. J Med Chem55:10241-61 (2012) 
 
Sigma non-opioid intracellular receptor 1
Name:Sigma non-opioid intracellular receptor 1
Type:Enzyme Catalytic Domain
Mol. Mass.:25124.85
Organism:Homo sapiens (Human)
Description:Q99720
Residue:223
BDBM50401859
NameBDBM50401859
Synonyms:CHEMBL2204677
TypeSmall organic molecule
Emp. Form.C37H46N2
Mol. Mass.518.7745
SMILESC(CN1CCN(Cc2ccccc2)CC1)Cc1ccc(cc1)C(c1ccccc1)C12CC3CC(CC(C3)C1)C2