Reaction Details
Target3-phosphoinositide-dependent protein kinase 1
LigandBDBM50401910
Substrate/Competitorn/a
Meas. Tech.ChEMBL_886438 (CHEMBL2213810)
IC50 26±n/a nM
Citation McIver, EGBryans, JBirchall, KChugh, JDrake, TLewis, SJOsborne, JSmiljanic-Hurley, ETsang, WKamal, ALevy, ANewman, MTaylor, DArthur, JSClark, KCohen, P Synthesis and structure-activity relationships of a novel series of pyrimidines as potent inhibitors of TBK1/IKKe kinases. Bioorg Med Chem Lett22:7169-73 (2012) 
 
3-phosphoinositide-dependent protein kinase 1
Name:3-phosphoinositide-dependent protein kinase 1
Type:Enzyme
Mol. Mass.:63157.65
Organism:Homo sapiens (Human)
Description:O15530
Residue:556
BDBM50401910
NameBDBM50401910
Synonyms:CHEMBL2207217
TypeSmall organic molecule
Emp. Form.C23H26BrN7O2S
Mol. Mass.544.467
SMILESBrc1cnc(Nc2cccc(NC(=O)N3CCCC3)c2)nc1NCCCNC(=O)c1cccs1