Reaction Details
TargetSerine/threonine-protein kinase TBK1
LigandBDBM50401928
Substrate/Competitorn/a
Meas. Tech.ChEMBL_886439 (CHEMBL2213811)
IC50 2±n/a nM
Citation McIver, EGBryans, JBirchall, KChugh, JDrake, TLewis, SJOsborne, JSmiljanic-Hurley, ETsang, WKamal, ALevy, ANewman, MTaylor, DArthur, JSClark, KCohen, P Synthesis and structure-activity relationships of a novel series of pyrimidines as potent inhibitors of TBK1/IKKe kinases. Bioorg Med Chem Lett22:7169-73 (2012) 
 
Serine/threonine-protein kinase TBK1
Name:Serine/threonine-protein kinase TBK1
Type:protein
Mol. Mass.:83645.20
Organism:Homo sapiens (Human)
Description:Q9UHD2
Residue:729
BDBM50401928
NameBDBM50401928
Synonyms:CHEMBL2207195
TypeSmall organic molecule
Emp. Form.C27H37N7O2
Mol. Mass.491.6284
SMILESCN1CCN(CC1)C(=O)c1ccc(Nc2ncc(C3CC3)c(NCCCNC(=O)C3CCC3)n2)cc1