Reaction Details
TargetHistamine H1 receptor
LigandBDBM50401947
Substrate/Competitorn/a
Meas. Tech.ChEMBL_886464 (CHEMBL2214275)
Ki 5500±n/a nM
Citation Löber, SHübner, HBuschauer, ASanna, FArgiolas, AMelis, MRGmeiner, P Novel azulene derivatives for the treatment of erectile dysfunction. Bioorg Med Chem Lett22:7151-4 (2012) 
 
Histamine H1 receptor
Name:Histamine H1 receptor
Type:G Protein-Coupled Receptor (GPCR)
Mol. Mass.:55808.72
Organism:Homo sapiens (Human)
Description:Cell pellets from SK-N-MC cells transfected with human H1 receptor were used in binding assay.
Residue:487
BDBM50401947
NameBDBM50401947
Synonyms:CHEMBL2207638
TypeSmall organic molecule
Emp. Form.C28H35N3O
Mol. Mass.429.597
SMILESCOc1ccccc1N1CCN(Cc2cc(CN3CCCCC3)c3cccccc23)CC1