Reaction Details
TargetD(1A) dopamine receptor
LigandBDBM50401949
Substrate/Competitorn/a
Meas. Tech.ChEMBL_886473 (CHEMBL2214284)
Ki 860±n/a nM
Citation Löber, SHübner, HBuschauer, ASanna, FArgiolas, AMelis, MRGmeiner, P Novel azulene derivatives for the treatment of erectile dysfunction. Bioorg Med Chem Lett22:7151-4 (2012) 
 
D(1A) dopamine receptor
Name:D(1A) dopamine receptor
Type:PROTEIN
Mol. Mass.:49269.92
Organism:Sus scrofa
Description:ChEMBL_1460140
Residue:446
BDBM50401949
NameBDBM50401949
Synonyms:CHEMBL2207635
TypeSmall organic molecule
Emp. Form.C23H26N2O2
Mol. Mass.362.4647
SMILESCOc1ccccc1N1CCN(Cc2cc(CO)c3cccccc23)CC1