Reaction Details
TargetD(1A) dopamine receptor
LigandBDBM50401951
Substrate/Competitorn/a
Meas. Tech.ChEMBL_886473 (CHEMBL2214284)
Ki 1300±n/a nM
Citation Löber, SHübner, HBuschauer, ASanna, FArgiolas, AMelis, MRGmeiner, P Novel azulene derivatives for the treatment of erectile dysfunction. Bioorg Med Chem Lett22:7151-4 (2012) 
 
D(1A) dopamine receptor
Name:D(1A) dopamine receptor
Type:PROTEIN
Mol. Mass.:49269.92
Organism:Sus scrofa
Description:ChEMBL_1460140
Residue:446
BDBM50401951
NameBDBM50401951
Synonyms:CHEMBL2207633
TypeSmall organic molecule
Emp. Form.C30H28N2O
Mol. Mass.432.5561
SMILESCOc1ccccc1N1CCN(Cc2cc(C#Cc3ccccc3)c3cccccc23)CC1