Reaction Details
Target5-hydroxytryptamine receptor 2A
LigandBDBM50401951
Substrate/Competitorn/a
Meas. Tech.ChEMBL_886467 (CHEMBL2214278)
Ki 1000±n/a nM
Citation Löber, SHübner, HBuschauer, ASanna, FArgiolas, AMelis, MRGmeiner, P Novel azulene derivatives for the treatment of erectile dysfunction. Bioorg Med Chem Lett22:7151-4 (2012) 
 
5-hydroxytryptamine receptor 2A
Name:5-hydroxytryptamine receptor 2A
Type:Enzyme Catalytic Domain
Mol. Mass.:52679.13
Organism:PIG
Description:5-HT2 0 0::P50129
Residue:470
BDBM50401951
NameBDBM50401951
Synonyms:CHEMBL2207633
TypeSmall organic molecule
Emp. Form.C30H28N2O
Mol. Mass.432.5561
SMILESCOc1ccccc1N1CCN(Cc2cc(C#Cc3ccccc3)c3cccccc23)CC1