Reaction Details
TargetD(3) dopamine receptor
LigandBDBM50401952
Substrate/Competitorn/a
Meas. Tech.ChEMBL_886470 (CHEMBL2214281)
Ki 370±n/a nM
Citation Löber, SHübner, HBuschauer, ASanna, FArgiolas, AMelis, MRGmeiner, P Novel azulene derivatives for the treatment of erectile dysfunction. Bioorg Med Chem Lett22:7151-4 (2012) 
 
D(3) dopamine receptor
Name:D(3) dopamine receptor
Type:n/a
Mol. Mass.:44243.43
Organism:Homo sapiens (Human)
Description:n/a
Residue:400
BDBM50401952
NameBDBM50401952
Synonyms:CHEMBL2207632
TypeSmall organic molecule
Emp. Form.C24H24N2O
Mol. Mass.356.4602
SMILESCOc1ccccc1N1CCN(Cc2cc(C#C)c3cccccc23)CC1