Reaction Details
TargetD(2) dopamine receptor
LigandBDBM50401948
Substrate/Competitorn/a
Meas. Tech.ChEMBL_886472 (CHEMBL2214283)
Ki 210±n/a nM
Citation Löber, SHübner, HBuschauer, ASanna, FArgiolas, AMelis, MRGmeiner, P Novel azulene derivatives for the treatment of erectile dysfunction. Bioorg Med Chem Lett22:7151-4 (2012) 
 
D(2) dopamine receptor
Name:D(2) dopamine receptor
Type:Cell-surface receptors
Mol. Mass.:50647.10
Organism:Homo sapiens (Human)
Description:P14416
Residue:443
BDBM50401948
NameBDBM50401948
Synonyms:CHEMBL2207637
TypeSmall organic molecule
Emp. Form.C25H31N3O
Mol. Mass.389.5331
SMILESCOc1ccccc1N1CCN(Cc2cc(CN(C)C)c3cccccc23)CC1