Reaction Details
TargetPancreatic alpha-amylase
LigandBDBM50401973
Substrate/Competitorn/a
Meas. Tech.ChEMBL_886576 (CHEMBL2215736)
IC50 18710±n/a nM
Citation Patil, VSNandre, KPGhosh, SRao, VJChopade, BABhosale, SVBhosale, SV Synthesis and glycosidase inhibitory activity of novel (2-phenyl-4H-benzopyrimedo[2,1-b]-thiazol-4-yliden)acetonitrile derivatives. Bioorg Med Chem Lett22:7011-4 (2012) 
 
Pancreatic alpha-amylase
Name:Pancreatic alpha-amylase
Type:Protein
Mol. Mass.:57088.07
Organism:Sus scrofa (Pig)
Description:P00690
Residue:511
BDBM50401973
NameBDBM50401973
Synonyms:CHEMBL2207953
TypeSmall organic molecule
Emp. Form.C23H15N3OS
Mol. Mass.381.45
SMILESCOc1ccc2N3C(Sc2c1)=NC(=C\C3=C/C#N)c1ccc2ccccc2c1