Reaction Details
TargetKappa-type opioid receptor
LigandBDBM50402017
Substrate/Competitorn/a
Meas. Tech.ChEMBL_886706 (CHEMBL2209606)
Ki 0.451±n/a nM
Citation Fujii, HImaide, SHirayama, SNemoto, TGouda, HHirono, SNagase, H Essential structure of opioid¿ receptor agonist nalfurafine for binding to the¿ receptor 3: synthesis of decahydro(iminoethano)phenanthrene derivatives with an oxygen functionality at the 3-position and their pharmacologies. Bioorg Med Chem Lett22:7711-4 (2012) 
 
Kappa-type opioid receptor
Name:Kappa-type opioid receptor
Type:G Protein-Coupled Receptor (GPCR)
Mol. Mass.:42744.99
Organism:Cavia porcellus (domestic guinea pig)
Description:P41144
Residue:380
BDBM50402017
NameBDBM50402017
Synonyms:CHEMBL2205412
TypeSmall organic molecule
Emp. Form.C28H38N2O4
Mol. Mass.466.6123
SMILESCN([C@H]1CC[C@@]2(O)[C@H]3CC4=C(C[C@@H](O)CC4)[C@@]2(CCN3CC2CC2)C1)C(=O)\C=C\c1ccoc1