Reaction Details
TargetSerine/threonine-protein kinase PLK1
LigandBDBM50402036
Substrate/Competitorn/a
Meas. Tech.ChEMBL_886838 (CHEMBL2210942)
Ki 15±n/a nM
Citation Zhang, QXia, ZMitten, MJLasko, LMKlinghofer, VBouska, JJohnson, EFPenning, TDLuo, YGiranda, VLShoemaker, ARStewart, KDDjuric, SWVasudevan, A Hit to Lead optimization of a novel class of squarate-containing polo-like kinases inhibitors. Bioorg Med Chem Lett22:7615-22 (2012) 
 
Serine/threonine-protein kinase PLK1
Name:Serine/threonine-protein kinase PLK1
Type:Serine/threonine-protein kinase
Mol. Mass.:68277.16
Organism:Homo sapiens (Human)
Description:P53350
Residue:603
BDBM50402036
NameBDBM50402036
Synonyms:CHEMBL2205461
TypeSmall organic molecule
Emp. Form.C20H19N7O2S
Mol. Mass.421.476
SMILESCC(C)(C)Nc1c(Nc2ccnc(Nc3ccc(cc3)-c3csnn3)n2)c(=O)c1=O