Reaction Details
TargetSerine/threonine-protein kinase PLK1
LigandBDBM50402034
Substrate/Competitorn/a
Meas. Tech.ChEMBL_886838 (CHEMBL2210942)
Ki 175±n/a nM
Citation Zhang, QXia, ZMitten, MJLasko, LMKlinghofer, VBouska, JJohnson, EFPenning, TDLuo, YGiranda, VLShoemaker, ARStewart, KDDjuric, SWVasudevan, A Hit to Lead optimization of a novel class of squarate-containing polo-like kinases inhibitors. Bioorg Med Chem Lett22:7615-22 (2012) 
 
Serine/threonine-protein kinase PLK1
Name:Serine/threonine-protein kinase PLK1
Type:Serine/threonine-protein kinase
Mol. Mass.:68277.16
Organism:Homo sapiens (Human)
Description:P53350
Residue:603
BDBM50402034
NameBDBM50402034
Synonyms:CHEMBL2205463
TypeSmall organic molecule
Emp. Form.C22H26N6O3
Mol. Mass.422.4802
SMILESCC(C)(C)Nc1c(Nc2ccnc(Nc3ccc(cc3)N3CCOCC3)n2)c(=O)c1=O