Reaction Details
TargetSerine/threonine-protein kinase PLK1
LigandBDBM50402025
Substrate/Competitorn/a
Meas. Tech.ChEMBL_886837 (CHEMBL2210941)
Ki>44000±n/a nM
Citation Zhang, QXia, ZMitten, MJLasko, LMKlinghofer, VBouska, JJohnson, EFPenning, TDLuo, YGiranda, VLShoemaker, ARStewart, KDDjuric, SWVasudevan, A Hit to Lead optimization of a novel class of squarate-containing polo-like kinases inhibitors. Bioorg Med Chem Lett22:7615-22 (2012) 
 
Serine/threonine-protein kinase PLK1
Name:Serine/threonine-protein kinase PLK1
Type:Serine/threonine-protein kinase
Mol. Mass.:68277.16
Organism:Homo sapiens (Human)
Description:P53350
Residue:603
BDBM50402025
NameBDBM50402025
Synonyms:CHEMBL2205438
TypeSmall organic molecule
Emp. Form.C19H22N6O2
Mol. Mass.366.417
SMILESC[C@@H](Nc1c(Nc2ccnc(Nc3ccncc3)n2)c(=O)c1=O)C(C)(C)C