Reaction Details
TargetSerine/threonine-protein kinase PLK1
LigandBDBM50402039
Substrate/Competitorn/a
Meas. Tech.ChEMBL_886837 (CHEMBL2210941)
EC50 5000±n/a nM
Citation Zhang, QXia, ZMitten, MJLasko, LMKlinghofer, VBouska, JJohnson, EFPenning, TDLuo, YGiranda, VLShoemaker, ARStewart, KDDjuric, SWVasudevan, A Hit to Lead optimization of a novel class of squarate-containing polo-like kinases inhibitors. Bioorg Med Chem Lett22:7615-22 (2012) 
 
Serine/threonine-protein kinase PLK1
Name:Serine/threonine-protein kinase PLK1
Type:Serine/threonine-protein kinase
Mol. Mass.:68277.16
Organism:Homo sapiens (Human)
Description:P53350
Residue:603
BDBM50402039
NameBDBM50402039
Synonyms:CHEMBL2205462
TypeSmall organic molecule
Emp. Form.C24H22N6O2
Mol. Mass.426.4705
SMILESCC(C)(C)Nc1c(Nc2ccnc(Nc3ccc4c(c3)[nH]c3ccccc43)n2)c(=O)c1=O