Reaction Details
TargetRho-associated protein kinase 2
LigandBDBM50402020
Substrate/Competitorn/a
Meas. Tech.ChEMBL_886729 (CHEMBL2209629)
Ki 430±n/a nM
Citation Zhang, QXia, ZMitten, MJLasko, LMKlinghofer, VBouska, JJohnson, EFPenning, TDLuo, YGiranda, VLShoemaker, ARStewart, KDDjuric, SWVasudevan, A Hit to Lead optimization of a novel class of squarate-containing polo-like kinases inhibitors. Bioorg Med Chem Lett22:7615-22 (2012) 
 
Rho-associated protein kinase 2
Name:Rho-associated protein kinase 2
Type:Protein
Mol. Mass.:160885.43
Organism:Homo sapiens (Human)
Description:O75116
Residue:1388
BDBM50402020
NameBDBM50402020
Synonyms:CHEMBL2205426
TypeSmall organic molecule
Emp. Form.C23H22N6O2
Mol. Mass.414.4598
SMILESCC(C)(C)Nc1c(Nc2ccnc(Nc3ccc(cc3)-c3ccncc3)n2)c(=O)c1=O