Reaction Details
TargetReceptor-type tyrosine-protein kinase FLT3
LigandBDBM50402072
Substrate/Competitorn/a
Meas. Tech.ChEMBL_887122 (CHEMBL2214347)
IC50 14±n/a nM
Citation Amombo, GMKramer, TLo Monte, FGöring, SFach, MSmith, SKolb, SSchubenel, RBaumann, KSchmidt, B Modification of a promiscuous inhibitor shifts the inhibition from¿-secretase to FLT-3. Bioorg Med Chem Lett22:7634-40 (2012) 
 
Receptor-type tyrosine-protein kinase FLT3
Name:Receptor-type tyrosine-protein kinase FLT3
Type:Enzyme
Mol. Mass.:112888.62
Organism:Homo sapiens (Human)
Description:P36888
Residue:993
BDBM50402072
NameBDBM50402072
Synonyms:CHEMBL2206013
TypeSmall organic molecule
Emp. Form.C21H21ClN2O3
Mol. Mass.384.856
SMILESClc1ccc2NC(=O)\C(=C/c3ccc(OCCN4CCOCC4)cc3)c2c1